BDBM50109796 3-[2-(6,7-Dimethoxy-3,4-dihydro-1H-isoquinolin-2-yl)-ethyl]-2-(4-dimethylamino-phenyl)-3H-quinazolin-4-one::CHEMBL421980
SMILES COc1cc2CCN(CCn3c(nc4ccccc4c3=O)-c3ccc(cc3)N(C)C)Cc2cc1OC
InChI Key InChIKey=HSFNWCVLEHOTNA-UHFFFAOYSA-N
Data  2 IC50
  Tab Delimited (TSV)   2D SDfile   Computed 3D by Vconf -m prep SDfile
Find this compound or compounds like it in BindingDB:
Activity Spreadsheet -- Enzyme Inhibition Constant Data from BindingDB
Found 1 hit for monomerid = 50109796
TargetATP-dependent translocase ABCB1(Mus musculus)
Xenova
Curated by ChEMBL
LigandPNGBDBM50109796(3-[2-(6,7-Dimethoxy-3,4-dihydro-1H-isoquinolin-2-y...)
Affinity DataIC50:  1.07E+3nM. Assay description: Inhibitory activity against P-glyco-protein (Pgp) using accumulation assay for Pgp expressing EMT6/AR1.0 cells.
In DepthDetails ArticlePubMed